{"text_format":"3","workbook":"xlsx","n_sheets":2,"sheets":["第五批","第一-第三批85户"],"not_rendered":{"external_links":1,"defined_names":2},"read":"whole","date_system":"1900"}

{"sheet":"第五批","index":0,"n_rows":21,"n_cols":4,"rows_kept":21,"merged":[[0,0,0,3]]}
["双龙新居项目认购客户选房结果"]
["序号","客户姓名","身份证号码","选房批次"]
[1,"薛*燕","522423********0523","第五批"]
[2,"李*","350182********2869","第五批"]
[3,"林*"," 35018********1291X\t","第五批"]
[4,"王*明"," 35012********15322\t","第五批"]
[5,"陈*金"," 35012********35225\t","第五批"]
[6,"李*"," 41282********86884\t","第五批"]
[7,"高*金","350126********2520","第五批"]
[8,"林*清"," 35018********51843\t","第五批"]
[9,"林*清"," 35012********05239\t","第五批"]
[10,"陈*","352230********1841","第五批"]
[11,"施*烨","350182********1664","第五批"]
[12,"吴*欢","352225********5528","第五批"]
[13,"林*青","350102********192X","第五批"]
[14,"张*瑞","350125********3631","第五批"]
[15,"董*英","350724********1529","第五批"]
[16,"范*","150102********6012","第五批"]
[17,"谢*常","352228********3023","第五批"]
[18,"俞*芬","350124********6542","第五批"]
[19,"许*国","350181********1231","第五批"]

{"sheet":"第一-第三批85户","index":1,"n_rows":87,"n_cols":6,"rows_kept":87,"hidden":true,"merged":[[0,0,0,3]]}
["双龙新居项目认购客户选房结果"]
["序号","客户姓名","身份证号码","选房批次","双困家庭情况","公租房家庭情况"]
[1,"张香珠","350105********0081","第一批","双困",{"$f":"VLOOKUP(B3,'[1]汇总表（含双困）'!$B$1:$F$65536,5,FALSE)","v":"公租房轮候家庭"}]
[2,"邓传富","362425********5418","第一批","双困","/"]
[3,"郭力安","232302********121X","第一批","双困","/"]
[4,"陈少东","350103********0150","第一批","双困",{"$f":"VLOOKUP(B6,'[1]汇总表（含双困）'!$B$1:$F$65536,5,FALSE)","v":"公租房在保家庭"}]
[5,"王志超","350102********1512","第一批","双困","/"]
[6,"陈华玲","350302********0029","第一批","双困",{"$f":"VLOOKUP(B8,'[1]汇总表（含双困）'!$B$1:$F$65536,5,FALSE)","v":"公租房在保家庭"}]
[7,"王燕川","350104********362X","第一批","双困",{"$f":"VLOOKUP(B9,'[1]汇总表（含双困）'!$B$1:$F$65536,5,FALSE)","v":"公租房在保家庭"}]
[8,"林立","350126********7620","第一批","双困",{"$f":"VLOOKUP(B10,'[1]汇总表（含双困）'!$B$1:$F$65536,5,FALSE)","v":"公租房在保家庭"}]
[9,"高震良","350103********0173","第一批","双困",{"$f":"VLOOKUP(B11,'[1]汇总表（含双困）'!$B$1:$F$65536,5,FALSE)","v":"公租房在保家庭"}]
[10,"黄巧玲","350525********4027","第一批","双困",{"$f":"VLOOKUP(B12,'[1]汇总表（含双困）'!$B$1:$F$65536,5,FALSE)","v":"公租房在保家庭"}]
[11,"高辉","350182********3254","第一批","双困","/"]
[12,"林可春","350124********603X","第一批","双困","/"]
[13,"高永景","350426********0034","第一批","双困",{"$f":"VLOOKUP(B15,'[1]汇总表（含双困）'!$B$1:$F$65536,5,FALSE)","v":"公租房在保家庭"}]
[14,"杨强","350103********0094","第一批","双困",{"$f":"VLOOKUP(B16,'[1]汇总表（含双困）'!$B$1:$F$65536,5,FALSE)","v":"公租房在保家庭"}]
[15,"杨宝钗","350182********4826","第一批","双困","/"]
[16,"杨品兴","350126********5213","第一批","双困","/"]
[17,"吴光辉","350702********6118","第一批","双困",{"$f":"VLOOKUP(B19,'[1]汇总表（含双困）'!$B$1:$F$65536,5,FALSE)","v":"公租房在保家庭"}]
[18,"陈巧云","350182********1664","第一批","双困","/"]
[19,"王家河","350182********4331","第一批","双困","/"]
[20,"肖建斌","350121********0751","第一批","双困",{"$f":"VLOOKUP(B22,'[1]汇总表（含双困）'!$B$1:$F$65536,5,FALSE)","v":"公租房轮候家庭"}]
[21,"陈炬州","350182********2473","第一批","双困","/"]
[22,"陈书镇","350182********6011","第一批","双困",{"$f":"VLOOKUP(B24,'[1]汇总表（含双困）'!$B$1:$F$65536,5,FALSE)","v":"公租房在保家庭"}]
[23,"林玲","350426********7025","第一批","双困","/"]
[24,"陈宝贵","350182********1759","第一批","双困","/"]
[25,"林梅玉","350126********4129","第一批","双困","/"]
[26,"何腾云","350121********3044","第一批","双困",{"$f":"VLOOKUP(B28,'[1]汇总表（含双困）'!$B$1:$F$65536,5,FALSE)","v":"公租房在保家庭"}]
[27,"栾正禹","370283********521X","第一批","双困","/"]
[28,"肖世辉","350426********6052","第二批","/",{"$f":"VLOOKUP(B30,'[1]汇总表（含双困）'!$B$1:$F$65536,5,FALSE)","v":"公租房在保家庭"}]
[29,"陈传昊","350182********433X","第二批","/","/"]
[30,"吴忠兰","350722********2324","第二批","/","/"]
[31,"林滢","350104********1520","第二批","/","/"]
[32,"刘景雪","350102********2822","第二批","双困",{"$f":"VLOOKUP(B34,'[1]汇总表（含双困）'!$B$1:$F$65536,5,FALSE)","v":"公租房在保家庭"}]
[33,"王文宇","420202********0494","第二批","/","/"]
[34,"姚慧芬","342701********0225","第二批","/","/"]
[35,"黄丽丹","350702********7863","第二批","双困",{"$f":"VLOOKUP(B37,'[1]汇总表（含双困）'!$B$1:$F$65536,5,FALSE)","v":"公租房在保家庭"}]
[36,"江峰","350126********6399","第二批","/","/"]
[37,"林鸿杰","350182********2572","第二批","/","/"]
[38,"陈颖","350181********1883","第二批","/","/"]
[39,"陈鸿艺","350582********102X","第二批","/","/"]
[40,"范中英","142431********7525","第二批","/","/"]
[41,"刘柯","350182********1577","第二批","/","/"]
[42,"周芳","511621********5666","第二批","/","/"]
[43,"陈梦瑶","350182********2480","第二批","/","/"]
[44,"陈煌","350182********3334","第二批","/","/"]
[45,"李强","350182********2218","第二批","/","/"]
[46,"李秀娟","350182********4820","第二批","/","/"]
[47,"林军义","350702********0313","第二批","/","/"]
[48,"罗煌","350182********2418","第二批","/","/"]
[49,"高宝钗","350182********3565","第二批","/","/"]
[50,"郑敏艺","350182********1523","第二批","/","/"]
[51,"段志龙","352203********0512","第二批","/","/"]
[52,"严赟","360121********0513","第二批","/","/"]
[53,"陈德金","352601********7015","第二批","/","/"]
[54,"李志晟","350126********1938","第二批","/","/"]
[55,"张新悦","513030********2028","第二批","/","/"]
[56,"蔡金凤","350182********6065","第二批","/","/"]
[57,"陈兵","350182********2258","第二批","/","/"]
[58,"陈世军","350702********8418","第二批","/","/"]
[59,"温小丽","350525********1020","第二批","/","/"]
[60,"刘峰","350182********1556","第二批","/","/"]
[61,"林文清","350182********267X","第二批","/","/"]
[62,"郑鉴祥","350182********1771","第二批","/","/"]
[63,"张建雄","352102********0810","第二批","/","/"]
[64,"张莺","350182********3522","第三批","/","/"]
[65,"林钦","350182********2624","第三批","/","/"]
[66,"杜雪玲","352225********0044","第三批","转双困","/"]
[67,"王佳琴","350182********5544","第三批","/","/"]
[68,"高思源","350182********2294","第三批","转双困","/"]
[69,"魏楠","340602********0023","第三批","/","/"]
[70,"陈依迟","350182********6811","第三批","转双困","/"]
[71,"范伟祯","352129********1545","第三批","/","/"]
[72,"周丽荷","350182********2927","第三批","/","/"]
[73,"黎立尧","350121********0378","第三批","/","/"]
[74,"王钦容","350182********1523","第三批","转双困","/"]
[75,"陈琳美","350182********6825","第三批","/","/"]
[76,"陈金明","350182********4318","第三批","/","/"]
[77,"林鑫泷","350182********1536","第三批","转双困","/"]
[78,"郑瑞英","350182********2629","第三批","/","/"]
[79,"刘勇","350182********3358","第三批","转双困","/"]
[80,"刘陈晖","350702********1318","第三批","/","/"]
[81,"邢凯伦","659001********1839","第三批","/","/"]
[82,"李欢","421221********3228","第三批","/","/"]
[83,"林燕云","350182********2623","第三批","/","/"]
[84,"李依云","350126********6314","第三批","/","/"]
[85,"徐书琛","350103********3150","第三批","/","/"]